Target
Transporter
Ligand
BDBM50052163
Substrate
Meas. Tech.
ChEMBL_142943 (CHEMBL750795)
IC50
929±n/a nM
Citation
 Kotian, PMascarella, SWAbraham, PLewin, AHBoja, JWKuhar, MJCarroll, FI Synthesis, ligand binding, and quantitative structure-activity relationship study of 3 beta-(4'-substituted phenyl)-2 beta-heterocyclic tropanes: evidence for an electrostatic interaction at the 2 beta-position. J Med Chem 39:2753-63 (1996)  
Target
Name:
Transporter
Synonyms:
Monoamine transporters; Norepininephrine & dopamine | Norepinephrine Monoamine transporters
Type:
PROTEIN
Mol. Mass.:
66787.87
Organism:
Rattus norvegicus
Description:
ChEMBL_1463061
Residue:
597
  
Inhibitor
Name:
BDBM50052163
Synonyms:
(2S,5R)-3-(4-Chloro-phenyl)-8-methyl-2-(5-phenyl-[1,3,4]oxadiazol-2-yl)-8-aza-bicyclo[3.2.1]octane | CHEMBL328584
Type:
Small organic molecule
Emp. Form.:
C22H22ClN3O
Mol. Mass.:
379.883
SMILES:
CN1[C@@H]2CCC1[C@H](C(C2)c1ccc(Cl)cc1)c1nnc(o1)-c1ccccc1
: