Target
Sodium-dependent serotonin transporter
Ligand
BDBM50052165
Substrate
Meas. Tech.
ChEMBL_201507 (CHEMBL805634)
IC50
65000±n/a nM
Citation
 Kotian, PMascarella, SWAbraham, PLewin, AHBoja, JWKuhar, MJCarroll, FI Synthesis, ligand binding, and quantitative structure-activity relationship study of 3 beta-(4'-substituted phenyl)-2 beta-heterocyclic tropanes: evidence for an electrostatic interaction at the 2 beta-position. J Med Chem 39:2753-63 (1996)  
Target
Name:
Sodium-dependent serotonin transporter
Synonyms:
5-HT Transporter 5HT transporter Anandamid membrane transporter, AMT Monoamine transporters; Norepinephrine & serotonin Slc6a4 Sodium-dependent serotonin transporter (SERT) | imipramine receptor
Type:
Multi-pass membrane protein
Mol. Mass.:
70168.43
Organism:
Rattus norvegicus (rat)
Description:
P31652
Residue:
630
  
Inhibitor
Name:
BDBM50052165
Synonyms:
(2R,5R)-8-Methyl-2-(5-phenyl-[1,3,4]oxadiazol-2-yl)-3-p-tolyl-8-aza-bicyclo[3.2.1]octane | CHEMBL328992
Type:
Small organic molecule
Emp. Form.:
C23H25N3O
Mol. Mass.:
359.4641
SMILES:
CN1[C@@H]2CCC1[C@@H](C(C2)c1ccc(C)cc1)c1nnc(o1)-c1ccccc1
: