Target
Sodium-dependent dopamine transporter
Ligand
BDBM50052158
Substrate
Meas. Tech.
ChEMBL_61831 (CHEMBL672594)
IC50
0.59±n/a nM
Citation
 Kotian, PMascarella, SWAbraham, PLewin, AHBoja, JWKuhar, MJCarroll, FI Synthesis, ligand binding, and quantitative structure-activity relationship study of 3 beta-(4'-substituted phenyl)-2 beta-heterocyclic tropanes: evidence for an electrostatic interaction at the 2 beta-position. J Med Chem 39:2753-63 (1996)  
Target
Name:
Sodium-dependent dopamine transporter
Synonyms:
DA transporter SC6A3_RAT Sodium-dependent dopamine transporter | Sodium-dependent dopamine transporter (DAT)
Type:
Multi-pass membrane protein
Mol. Mass.:
68749.45
Organism:
Rattus norvegicus (rat)
Description:
P23977
Residue:
619
  
Inhibitor
Name:
BDBM50052158
Synonyms:
(2S,5R)-3-(4-Chloro-phenyl)-8-methyl-2-(3-methyl-isoxazol-5-yl)-8-aza-bicyclo[3.2.1]octane | CHEMBL317284
Type:
Small organic molecule
Emp. Form.:
C18H21ClN2O
Mol. Mass.:
316.825
SMILES:
CN1[C@@H]2CCC1[C@H](C(C2)c1ccc(Cl)cc1)c1cc(C)no1
: