Target
Adenosine receptor A2a
Ligand
BDBM50367298
Substrate
Meas. Tech.
ChEMBL_30917 (CHEMBL647261)
Ki
63800±n/a nM
Citation
 van Rhee, AMJiang, JLMelman, NOlah, MEStiles, GLJacobson, KA Interaction of 1,4-dihydropyridine and pyridine derivatives with adenosine receptors: selectivity for A3 receptors. J Med Chem 39:2980-9 (1996)  
Target
Name:
Adenosine receptor A2a
Synonyms:
AA2AR_RAT Adenosine A2 receptor Adenosine Receptors A2a (A2a) Adenosine receptors A2a Rat striatal adenosine A2a receptor
Type:
G Protein-Coupled Receptor (GPCR)
Mol. Mass.:
45015.65
Organism:
Rattus norvegicus (rat)
Description:
Rat A2A receptors expressed in CHO cells.
Residue:
410
  
Inhibitor
Name:
BDBM50367298
Synonyms:
Cardene | NICARDIPINE
Type:
Small organic molecule
Emp. Form.:
C26H29N3O6
Mol. Mass.:
479.525
SMILES:
COC(=O)C1C(C(C(=O)OCCN(C)Cc2ccccc2)=C(C)N=C1C)c1cccc(c1)[N+]([O-])=O
: