Target
5-hydroxytryptamine receptor 1A
Ligand
BDBM50052569
Substrate
Meas. Tech.
ChEMBL_827 (CHEMBL615827)
IC50
10±n/a nM
Citation
 Perrone, RBerardi, FLeopoldo, MTortorella, VFornaretto, MGCaccia, CMcArthur, RA 1-aryl-4-[(1-tetralinyl)alkyl]piperazines: alkylamido and alkylamino derivatives. Synthesis, 5-HT1A receptor affinity, and selectivity. 3. J Med Chem 39:3195-202 (1996)  
Target
Name:
5-hydroxytryptamine receptor 1A
Synonyms:
5-HT-1A 5-HT1A 5-hydroxytryptamine receptor 1A (5HT1A) 5ht1a Htr1a Serotonin 1a (5-HT1a) receptor/Adrenergic receptor alpha-1 | Serotonin receptor 1A
Type:
G Protein-Coupled Receptor (GPCR)
Mol. Mass.:
46445.29
Organism:
Rattus norvegicus (rat)
Description:
Binding assays were performed using rat hippocampal membranes.
Residue:
422
  
Inhibitor
Name:
BDBM50052569
Synonyms:
CHEMBL107486 | {3-[4-(2-Methoxy-phenyl)-piperazin-1-yl]-propyl}-(5-methoxy-1,2,3,4-tetrahydro-naphthalen-1-yl)-amine
Type:
Small organic molecule
Emp. Form.:
C25H35N3O2
Mol. Mass.:
409.5643
SMILES:
COc1cccc2C(CCCc12)NCCCN1CCN(CC1)c1ccccc1OC
: