Target
Adenosylhomocysteinase
Ligand
BDBM50369157
Substrate
Meas. Tech.
ChEMBL_196742 (CHEMBL857626)
Ki
770±n/a nM
Citation
 Wnuk, SFLiu, SYuan, CSBorchardt, RTRobins, MJ Inactivation of S-adenosyl-L-homocysteine hydrolase by amide and ester derivatives of adenosine-5'-carboxylic acid. J Med Chem 39:4162-6 (1996)  
Target
Name:
Adenosylhomocysteinase
Synonyms:
AHCY SAHH | SAHH_HUMAN
Type:
PROTEIN
Mol. Mass.:
47714.06
Organism:
Homo sapiens (Human)
Description:
ChEMBL_1507791
Residue:
432
  
Inhibitor
Name:
BDBM50369157
Synonyms:
CHEMBL608915
Type:
Small organic molecule
Emp. Form.:
C13H17N5O5
Mol. Mass.:
323.3046
SMILES:
CC(C)OC(=O)[C@H]1OC([C@H](O)[C@@H]1O)n1cnc2c(N)ncnc12
: