Target
D(2) dopamine receptor
Ligand
BDBM50010621
Substrate
Meas. Tech.
ChEMBL_61782 (CHEMBL670536)
Ki
24±n/a nM
Citation
 van Vliet, LATepper, PGDijkstra, DDamsma, GWikström, HPugsley, TAAkunne, HCHeffner, TGGlase, SAWise, LD Affinity for dopamine D2, D3, and D4 receptors of 2-aminotetralins. Relevance of D2 agonist binding for determination of receptor subtype selectivity. J Med Chem 39:4233-7 (1996)  
Target
Name:
D(2) dopamine receptor
Synonyms:
D(2) dopamine receptor DOPAMINE D2 Long DRD2 Dopamine D2 receptor Dopamine D2 receptor (D2R) Dopamine2-like | d2
Type:
Cell-surface receptors
Mol. Mass.:
50647.10
Organism:
Homo sapiens (Human)
Description:
P14416
Residue:
443
  
Inhibitor
Name:
BDBM50010621
Synonyms:
6-[Propyl-(2-thiophen-3-yl-ethyl)-amino]-5,6,7,8-tetrahydro-naphthalen-1-ol | CHEMBL7806
Type:
Small organic molecule
Emp. Form.:
C19H25NOS
Mol. Mass.:
315.473
SMILES:
CCCN(CCc1ccsc1)C1CCc2c(O)cccc2C1
: