Target
Thymidylate synthase
Ligand
BDBM50369176
Substrate
Meas. Tech.
ChEMBL_209817 (CHEMBL815682)
IC50
12000±n/a nM
Citation
 Abraham, TWKalman, TIMcIntee, EJWagner, CR Synthesis and biological activity of aromatic amino acid phosphoramidates of 5-fluoro-2'-deoxyuridine and 1-beta-arabinofuranosylcytosine: evidence of phosphoramidase activity. J Med Chem 39:4569-75 (1996)  
Target
Name:
Thymidylate synthase
Synonyms:
TS TYSY_MOUSE | Tyms
Type:
PROTEIN
Mol. Mass.:
34957.15
Organism:
Mus musculus
Description:
ChEMBL_1340097
Residue:
307
  
Inhibitor
Name:
BDBM50369176
Synonyms:
CHEMBL1791078
Type:
Small organic molecule
Emp. Form.:
C20H22FN4O9P
Mol. Mass.:
512.3822
SMILES:
COC(=O)[C@@H](NP(O)(=O)OC[C@H]1O[C@H](C[C@@H]1O)n1cc(F)c(=O)[nH]c1=O)c1c[nH]c2ccccc12
: