Target
Thymidylate synthase
Ligand
BDBM50340678
Substrate
Meas. Tech.
ChEMBL_209814 (CHEMBL815679)
IC50
7300±n/a nM
Citation
 Abraham, TWKalman, TIMcIntee, EJWagner, CR Synthesis and biological activity of aromatic amino acid phosphoramidates of 5-fluoro-2'-deoxyuridine and 1-beta-arabinofuranosylcytosine: evidence of phosphoramidase activity. J Med Chem 39:4569-75 (1996)  
Target
Name:
Thymidylate synthase
Synonyms:
TS TYSY_MOUSE | Tyms
Type:
PROTEIN
Mol. Mass.:
34957.15
Organism:
Mus musculus
Description:
ChEMBL_1340097
Residue:
307
  
Inhibitor
Name:
BDBM50340678
Synonyms:
1-(beta-D-2-deoxy-erythro-pentofuranosyl)-5-fluorouracil 5-Fluoro-1-((2R,4S,5R)-4-hydroxy-5-hydroxymethyl-tetrahydro-furan-2-yl)-1H-pyrimidine-2,4-dione 5-fluoro-1-((2R,4S,5R)-4-hydroxy-5-(hydroxymethyl)-tetrahydrofuran-2-yl)pyrimidine-2,4(1H,3H)-dione 5-fluoro-2'-Deoxy-uridine CHEMBL917 FUDR | Fluoruridine Deoxyribose
Type:
Small organic molecule
Emp. Form.:
C9H11FN2O5
Mol. Mass.:
246.1924
SMILES:
OC[C@H]1O[C@H](C[C@@H]1O)n1cc(F)c(=O)[nH]c1=O
: