Target
Dihydroorotate dehydrogenase (quinone), mitochondrial
Ligand
BDBM50054546
Substrate
Meas. Tech.
ChEMBL_52873 (CHEMBL666232)
IC50
50000±n/a nM
Citation
 Kuo, EAHambleton, PTKay, DPEvans, PLMatharu, SSLittle, EMcDowall, NJones, CBHedgecock, CJYea, CMChan, AWHairsine, PWAger, IRTully, WRWilliamson, RAWestwood, R Synthesis, structure-activity relationships, and pharmacokinetic properties of dihydroorotate dehydrogenase inhibitors: 2-cyano-3-cyclopropyl-3-hydroxy-N-[3'-methyl-4'-(trifluoromethyl)phenyl ] propenamide and related compounds. J Med Chem 39:4608-21 (1996)  
Target
Name:
Dihydroorotate dehydrogenase (quinone), mitochondrial
Synonyms:
Dhodh PYRD_MOUSE
Type:
PROTEIN
Mol. Mass.:
42711.08
Organism:
Mus musculus
Description:
ChEMBL_1366444
Residue:
395
  
Inhibitor
Name:
BDBM50054546
Synonyms:
(Z)-2-Cyano-3-cyclopropyl-3-hydroxy-N-[4-(4-trifluoromethyl-thiazol-2-yl)-phenyl]-acrylamide | CHEMBL143458
Type:
Small organic molecule
Emp. Form.:
C17H12F3N3O2S
Mol. Mass.:
379.356
SMILES:
FC(F)(F)c1csc(n1)-c1ccc(NC(=O)C(C#N)C(=O)C2CC2)cc1
: