Target
Glucocorticoid receptor
Ligand
BDBM50354850
Substrate
Meas. Tech.
ChEMBL_71419 (CHEMBL685137)
IC50
2.9±n/a nM
Citation
 Ashton, MJLawrence, CKarlsson, JAStuttle, KANewton, CGVacher, BYWebber, SWithnall, MJ Anti-inflammatory 17beta-thioalkyl-16alpha,17alpha-ketal and -acetal androstanes: a new class of airway selective steroids for the treatment of asthma. J Med Chem 39:4888-96 (1997)  
Target
Name:
Glucocorticoid receptor
Synonyms:
GCR_RAT Glucocorticoid Receptor (GR) Grl | Nr3c1
Type:
Enzyme Catalytic Domain
Mol. Mass.:
87556.83
Organism:
RAT
Description:
Glucocorticoid 0 RAT::P06536
Residue:
795
  
Inhibitor
Name:
BDBM50354850
Synonyms:
BUDESONIDE US11554172, Compound Budesonide | US11760775, Compound Budesonide
Type:
Small organic molecule
Emp. Form.:
C25H34O6
Mol. Mass.:
430.5339
SMILES:
CCCC1O[C@@H]2C[C@H]3[C@@H]4CCC5=CC(=O)C=C[C@]5(C)[C@H]4[C@@H](O)C[C@]3(C)[C@@]2(O1)C(=O)CO
: