Target
Glucocorticoid receptor
Ligand
BDBM50054966
Substrate
Meas. Tech.
ChEMBL_71419 (CHEMBL685137)
IC50
1.7±n/a nM
Citation
 Ashton, MJLawrence, CKarlsson, JAStuttle, KANewton, CGVacher, BYWebber, SWithnall, MJ Anti-inflammatory 17beta-thioalkyl-16alpha,17alpha-ketal and -acetal androstanes: a new class of airway selective steroids for the treatment of asthma. J Med Chem 39:4888-96 (1997)  
Target
Name:
Glucocorticoid receptor
Synonyms:
GCR_RAT Glucocorticoid Receptor (GR) Grl | Nr3c1
Type:
Enzyme Catalytic Domain
Mol. Mass.:
87556.83
Organism:
RAT
Description:
Glucocorticoid 0 RAT::P06536
Residue:
795
  
Inhibitor
Name:
BDBM50054966
Synonyms:
(4aS,4bR,5S,6aS,6bR,8R,9aR)-4b-Fluoro-5-hydroxy-4a,6a-dimethyl-6b-methylsulfanyl-8-propyl-4a,4b,5,6,6a,6b,9a,10,10a,10b,11,12-dodecahydro-7,9-dioxa-pentaleno[2,1-a]phenanthren-2-one | CHEMBL343438
Type:
Small organic molecule
Emp. Form.:
C24H33FO4S
Mol. Mass.:
436.58
SMILES:
CCC[C@@H]1O[C@@H]2CC3C4CCC5=CC(=O)C=C[C@]5(C)[C@@]4(F)[C@@H](O)C[C@]3(C)[C@@]2(O1)SC
: