Target
Glucocorticoid receptor
Ligand
BDBM50369181
Substrate
Meas. Tech.
ChEMBL_71419 (CHEMBL685137)
IC50
2.3±n/a nM
Citation
 Ashton, MJLawrence, CKarlsson, JAStuttle, KANewton, CGVacher, BYWebber, SWithnall, MJ Anti-inflammatory 17beta-thioalkyl-16alpha,17alpha-ketal and -acetal androstanes: a new class of airway selective steroids for the treatment of asthma. J Med Chem 39:4888-96 (1997)  
Target
Name:
Glucocorticoid receptor
Synonyms:
GCR_RAT Glucocorticoid Receptor (GR) Grl | Nr3c1
Type:
Enzyme Catalytic Domain
Mol. Mass.:
87556.83
Organism:
RAT
Description:
Glucocorticoid 0 RAT::P06536
Residue:
795
  
Inhibitor
Name:
BDBM50369181
Synonyms:
TIPREDANE
Type:
Small organic molecule
Emp. Form.:
C22H31FO2S2
Mol. Mass.:
410.609
SMILES:
CCS[C@@]1(CC[C@H]2[C@@H]3CCC4=CC(=O)C=C[C@]4(C)[C@@]3(F)[C@@H](O)C[C@]12C)SC
: