Target
5-hydroxytryptamine receptor 2A
Ligand
BDBM50055000
Substrate
Meas. Tech.
ChEMBL_2579 (CHEMBL617601)
IC50
241±n/a nM
Citation
 Perrone, RBerardi, FColabufo, NALeopoldo, MTortorella, VFornaretto, MGCaccia, CMcArthur, RA Structure-activity relationship studies on the 5-HT(1A) receptor affinity of 1-phenyl-4-[omega-(alpha- or beta-tetralinyl)alkyl]piperazines. 4. J Med Chem 39:4928-34 (1997)  
Target
Name:
5-hydroxytryptamine receptor 2A
Synonyms:
5-HT-2A 5-HT2A 5-hydroxytryptamine receptor 2A (5HT2A) Htr2 Serotonin Receptor 2A
Type:
G Protein-Coupled Receptor (GPCR)
Mol. Mass.:
52852.05
Organism:
Rattus norvegicus (rat)
Description:
Rat cortex membranes 5-HT2A receptors.
Residue:
471
  
Inhibitor
Name:
BDBM50055000
Synonyms:
1-[2-(5-Methoxy-3,4-dihydro-naphthalen-2-yl)-ethyl]-4-phenyl-piperazine | CHEMBL147387
Type:
Small organic molecule
Emp. Form.:
C23H28N2O
Mol. Mass.:
348.4812
SMILES:
COc1cccc2C=C(CCN3CCN(CC3)c3ccccc3)CCc12
: