Target
Acetylcholinesterase
Ligand
BDBM50055166
Substrate
Meas. Tech.
ChEMBL_27805 (CHEMBL636515)
IC50
816000±n/a nM
Citation
 Cho, SJGarsia, MLBier, JTropsha, A Structure-based alignment and comparative molecular field analysis of acetylcholinesterase inhibitors. J Med Chem 39:5064-71 (1997)  
Target
Name:
Acetylcholinesterase
Synonyms:
3.1.1.7 Acetylcholinesterase (AChE) ache
Type:
Mol. Mass.:
65900.74
Organism:
Tetronarce californica (Pacific electric ray) (Torpedo californica)
Description:
P04058
Residue:
586
  
Inhibitor
Name:
BDBM50055166
Synonyms:
CHEMBL136229 Hexyl-trimethyl-ammonium; iodide | SAMPL5, OA-G3
Type:
Small organic molecule
Emp. Form.:
C9H22N
Mol. Mass.:
144.2771
SMILES:
CCCCCC[N+](C)(C)C
: