Target
Acetylcholinesterase
Ligand
BDBM50055190
Substrate
Meas. Tech.
ChEMBL_27793 (CHEMBL637620)
IC50
628000±n/a nM
Citation
 Cho, SJGarsia, MLBier, JTropsha, A Structure-based alignment and comparative molecular field analysis of acetylcholinesterase inhibitors. J Med Chem 39:5064-71 (1997)  
Target
Name:
Acetylcholinesterase
Synonyms:
3.1.1.7 Acetylcholinesterase (AChE) ache
Type:
Mol. Mass.:
65900.74
Organism:
Tetronarce californica (Pacific electric ray) (Torpedo californica)
Description:
P04058
Residue:
586
  
Inhibitor
Name:
BDBM50055190
Synonyms:
CHEMBL148484 Trimethyl-(3-nitro-phenyl)-ammonium; iodide
Type:
Small organic molecule
Emp. Form.:
C9H13N2O2
Mol. Mass.:
181.2112
SMILES:
C[N+](C)(C)c1cccc(c1)[N+]([O-])=O
: