Target
Type-1 angiotensin II receptor
Ligand
BDBM50049200
Substrate
Meas. Tech.
ChEMBL_36776 (CHEMBL650298)
IC50
11±n/a nM
Citation
 Wexler, RRGreenlee, WJIrvin, JDGoldberg, MRPrendergast, KSmith, RDTimmermans, PB Nonpeptide angiotensin II receptor antagonists: the next generation in antihypertensive therapy. J Med Chem 39:625-56 (1996)  
Target
Name:
Type-1 angiotensin II receptor
Synonyms:
AGTR1 Angiotensin II type 1a (AT-1a) receptor
Type:
PROTEIN
Mol. Mass.:
41107.81
Organism:
Bos taurus
Description:
ChEMBL_36779
Residue:
359
  
Inhibitor
Name:
BDBM50049200
Synonyms:
2-Ethyl-5,7-dimethyl-3-[9-(1H-tetrazol-5-ylmethyl)-9H-fluoren-2-ylmethyl]-3H-imidazo[4,5-b]pyridine KW-3433
Type:
Small organic molecule
Emp. Form.:
C26H25N7
Mol. Mass.:
435.5236
SMILES:
CCc1nc2c(C)cc(C)nc2n1Cc1ccc-2c(c1)C(Cc1nnn[nH]1)c1ccccc-21
: