Target
Nischarin
Ligand
BDBM50016897
Substrate
Meas. Tech.
ChEMBL_220571 (CHEMBL841852)
Ki
8.9±n/a nM
Citation
 Munk, SALai, RKBurke, JEArasasingham, PNKharlamb, ABManlapaz, CAPadillo, EUWijono, MKHasson, DWWheeler, LAGarst, ME Synthesis and pharmacologic evaluation of 2-endo-amino-3-exo-isopropylbicyclo[2.2.1]heptane: a potent imidazoline1 receptor specific agent. J Med Chem 39:1193-5 (1996)  
Target
Name:
Nischarin
Synonyms:
IRAS Imidazoline receptor 1 (I1R) NISCH Nischarin
Type:
Enzyme
Mol. Mass.:
166571.31
Organism:
Homo sapiens (Human)
Description:
Q9Y2I1
Residue:
1504
  
Inhibitor
Name:
BDBM50016897
Synonyms:
2-(2,6-dichloroanilino)-1,3-diazacyclopentene-(2) CLONIDINE clonidine (amino form)
Type:
Small organic molecule
Emp. Form.:
C9H9Cl2N3
Mol. Mass.:
230.094
SMILES:
Clc1cccc(Cl)c1\[#7]=[#6]-1\[#7]-[#6]-[#6]-[#7]-1
: