Target
L-selectin
Ligand
BDBM50450369
Substrate
Meas. Tech.
ChEMBL_199992 (CHEMBL873249)
IC50
>1000000±n/a nM
Citation
 Ohmoto, HNakamura, KInoue, TKondo, NInoue, YYoshino, KKondo, HIshida, HKiso, MHasegawa, A Studies on selectin blocker. 1. Structure-activity relationships of sialyl Lewis X analogs. J Med Chem 39:1339-43 (1996)  
Target
Name:
L-selectin
Synonyms:
LNHR LYAM1_HUMAN SELL | Selectin
Type:
PROTEIN
Mol. Mass.:
42187.20
Organism:
Homo sapiens (Human)
Description:
ChEMBL_200000
Residue:
372
  
Inhibitor
Name:
BDBM50450369
Synonyms:
SIALYL LEWIS X Sialyl lewis-x sialyl LewisX
Type:
Small organic molecule
Emp. Form.:
C31H52N2O23
Mol. Mass.:
820.7442
SMILES:
[H][C@]1(O[C@@](C[C@H](O)[C@H]1NC(C)=O)(O[C@H]1[C@@H](O)[C@@H](CO)O[C@@H](O[C@H]([C@H](O)CO)[C@H](O[C@@H]2O[C@@H](C)[C@@H](O)[C@@H](O)[C@@H]2O)[C@@H](NC(C)=O)C=O)[C@@H]1O)C(O)=O)[C@H](O)[C@H](O)CO
: