Target
Neuromedin-K receptor
Ligand
BDBM50050642
Substrate
Meas. Tech.
ChEMBL_209397 (CHEMBL811329)
IC50
22±n/a nM
Citation
 Boden, PEden, JMHodgson, JHorwell, DCHughes, JMcKnight, ATLewthwaite, RAPritchard, MCRaphy, JMeecham, KRatcliffe, GSSuman-Chauhan, NWoodruff, GN Use of a dipeptide chemical library in the development of non-peptide tachykinin NK3 receptor selective antagonists. J Med Chem 39:1664-75 (1996)  
Target
Name:
Neuromedin-K receptor
Synonyms:
NK3R_CAVPO Neurokinin NK3 TACR3
Type:
Enzyme Catalytic Domain
Mol. Mass.:
49456.44
Organism:
GUINEA PIG
Description:
Neurokinin NK3 TACR3 GUINEA PIG::P30098
Residue:
440
  
Inhibitor
Name:
BDBM50050642
Synonyms:
CHEMBL296014 | {(S)-1-[(R)-1-(8-Hydroxy-octylcarbamoyl)-1-methyl-2-phenyl-ethylcarbamoyl]-2-phenyl-ethyl}-carbamic acid tert-butyl ester
Type:
Small organic molecule
Emp. Form.:
C32H47N3O5
Mol. Mass.:
553.7327
SMILES:
CC(C)(C)OC(=O)N[C@@H](Cc1ccccc1)C(=O)N[C@](C)(Cc1ccccc1)C(=O)NCCCCCCCCO
: