Target
Neuromedin-K receptor
Ligand
BDBM50050649
Substrate
Meas. Tech.
ChEMBL_209704 (CHEMBL812811)
IC50
1730±n/a nM
Citation
 Boden, PEden, JMHodgson, JHorwell, DCHughes, JMcKnight, ATLewthwaite, RAPritchard, MCRaphy, JMeecham, KRatcliffe, GSSuman-Chauhan, NWoodruff, GN Use of a dipeptide chemical library in the development of non-peptide tachykinin NK3 receptor selective antagonists. J Med Chem 39:1664-75 (1996)  
Target
Name:
Neuromedin-K receptor
Synonyms:
NK3R_RAT Tac3r | Tacr3
Type:
Mol. Mass.:
51128.60
Organism:
Rattus norvegicus
Description:
ChEMBL_10983
Residue:
452
  
Inhibitor
Name:
BDBM50050649
Synonyms:
CHEMBL444832 | {(S)-1-[(R)-1-Methyl-2-phenyl-1-(7-ureido-heptylcarbamoyl)-ethylcarbamoyl]-2-phenyl-ethyl}-carbamic acid tert-butyl ester
Type:
Small organic molecule
Emp. Form.:
C32H47N5O5
Mol. Mass.:
581.7461
SMILES:
CC(C)(C)OC(=O)N[C@@H](Cc1ccccc1)C(=O)N[C@](C)(Cc1ccccc1)C(=O)NCCCCCCCNC(N)=O
: