Target
Glycogen phosphorylase, brain form
Ligand
BDBM50057755
Substrate
Meas. Tech.
ChEMBL_70987 (CHEMBL680565)
Ki
370000±n/a nM
Citation
 Pastor, MCruciani, GClementi, S Smart region definition: a new way to improve the predictive ability and interpretability of three-dimensional quantitative structure-activity relationships. J Med Chem 40:1455-64 (1997)  
Target
Name:
Glycogen phosphorylase, brain form
Synonyms:
Brain glycogen phosphorylase PYGB | PYGB_HUMAN
Type:
PROTEIN
Mol. Mass.:
96699.35
Organism:
Homo sapiens (Human)
Description:
ChEMBL_70998
Residue:
843
  
Inhibitor
Name:
BDBM50057755
Synonyms:
2-Amino-N-(3,4,5-trihydroxy-6-hydroxymethyl-tetrahydro-pyran-2-yl)-acetamide | CHEMBL539161
Type:
Small organic molecule
Emp. Form.:
C8H16N2O6
Mol. Mass.:
236.2224
SMILES:
NCC(=O)NC1OC(CO)C(O)C(O)C1O
: