Target
Glycogen phosphorylase, brain form
Ligand
BDBM50422220
Substrate
Meas. Tech.
ChEMBL_70987 (CHEMBL680565)
Ki
39000±n/a nM
Citation
 Pastor, MCruciani, GClementi, S Smart region definition: a new way to improve the predictive ability and interpretability of three-dimensional quantitative structure-activity relationships. J Med Chem 40:1455-64 (1997)  
Target
Name:
Glycogen phosphorylase, brain form
Synonyms:
Brain glycogen phosphorylase PYGB | PYGB_HUMAN
Type:
PROTEIN
Mol. Mass.:
96699.35
Organism:
Homo sapiens (Human)
Description:
ChEMBL_70998
Residue:
843
  
Inhibitor
Name:
BDBM50422220
Synonyms:
CHEMBL334587
Type:
Small organic molecule
Emp. Form.:
C9H17NO6
Mol. Mass.:
235.2344
SMILES:
CCC(=O)N[C@@H]1O[C@H](CO)[C@@H](O)[C@H](O)[C@H]1O
: