Target
D(1) dopamine receptor
Ligand
BDBM50033116
Substrate
Meas. Tech.
ChEMBL_59005 (CHEMBL880003)
EC50
8.2±n/a nM
Citation
 Michaelides, MRHong, YDiDomenico, SBayburt, EKAsin, KEBritton, DRLin, CWShiosaki, K Substituted hexahydrobenzo[f]thieno[c]quinolines as dopamine D1-selective agonists: synthesis and biological evaluation in vitro and in vivo. J Med Chem 40:1585-99 (1997)  
Target
Name:
D(1) dopamine receptor
Synonyms:
D(1) dopamine receptor Dopamine D1 receptor
Type:
Mol. Mass.:
40664.04
Organism:
Carassius auratus
Description:
Residue:
363
  
Inhibitor
Name:
BDBM50033116
Synonyms:
(1R,3S)-3-Adamantan-1-yl-1-aminomethyl-isochroman-5,6-diol CHEMBL291143 | cid_6603703
Type:
Small organic molecule
Emp. Form.:
C20H27NO3
Mol. Mass.:
329.4333
SMILES:
NC[C@@H]1O[C@@H](Cc2c(O)c(O)ccc12)C12CC3CC(CC(C3)C1)C2
: