Target
cGMP-specific 3',5'-cyclic phosphodiesterase
Ligand
BDBM14361
Substrate
Meas. Tech.
ChEMBL_155376 (CHEMBL760829)
Ki
>200000±n/a nM
Citation
 Bourguignon, JJDésaubry, LRaboisson, PWermuth, CGLugnier, C 9-Benzyladenines: potent and selective cAMP phosphodiesterase inhibitors. J Med Chem 40:1768-70 (1997)  
Target
Name:
cGMP-specific 3',5'-cyclic phosphodiesterase
Synonyms:
3',5'-cyclic phosphodiesterase PDE5 PDE5A_HUMAN Phosphodiesterase 5 (PDE5) Phosphodiesterase 5A (PDE5A) cGMP-specific 3',5'-cyclic phosphodiesterase
Type:
Protein
Mol. Mass.:
99975.83
Organism:
Homo sapiens (Human)
Description:
O76074
Residue:
875
  
Inhibitor
Name:
BDBM14361
Synonyms:
(R,S)-Rolipram 4-[3-(cyclopentyloxy)-4-methoxyphenyl]pyrrolidin-2-one CHEMBL63 | Rolipram
Type:
Small organic molecule
Emp. Form.:
C16H21NO3
Mol. Mass.:
275.3428
SMILES:
COc1ccc(cc1OC1CCCC1)C1CNC(=O)C1
: