Target
cGMP-dependent 3',5'-cyclic phosphodiesterase
Ligand
BDBM14361
Substrate
Meas. Tech.
ChEMBL_156333 (CHEMBL760135)
Ki
>200000±n/a nM
Citation
 Bourguignon, JJDésaubry, LRaboisson, PWermuth, CGLugnier, C 9-Benzyladenines: potent and selective cAMP phosphodiesterase inhibitors. J Med Chem 40:1768-70 (1997)  
Target
Name:
cGMP-dependent 3',5'-cyclic phosphodiesterase
Synonyms:
CGS-PDE Homo sapiens phosphodiesterase 2A (PDE2A) PDE2A cGSPDE
Type:
Enzyme Catalytic Domain
Mol. Mass.:
105691.58
Organism:
Homo sapiens (Human)
Description:
O00408
Residue:
941
  
Inhibitor
Name:
BDBM14361
Synonyms:
(R,S)-Rolipram 4-[3-(cyclopentyloxy)-4-methoxyphenyl]pyrrolidin-2-one CHEMBL63 | Rolipram
Type:
Small organic molecule
Emp. Form.:
C16H21NO3
Mol. Mass.:
275.3428
SMILES:
COc1ccc(cc1OC1CCCC1)C1CNC(=O)C1
: