Target
Nitric oxide synthase, endothelial
Ligand
BDBM50058451
Substrate
Meas. Tech.
ChEMBL_65317 (CHEMBL678090)
Ki
7700±n/a nM
Citation
 Shearer, BGLee, SOplinger, JAFrick, LWGarvey, EPFurfine, ES Substituted N-phenylisothioureas: potent inhibitors of human nitric oxide synthase with neuronal isoform selectivity. J Med Chem 40:1901-5 (1997)  
Target
Name:
Nitric oxide synthase, endothelial
Synonyms:
Constitutive NOS Endothelial NOS NOS type III NOS3_HUMAN Nitric oxide synthase (inducible and endothelial) Nitric-oxide synthase (endothelial and brain) eNOS
Type:
Enzyme Catalytic Domain
Mol. Mass.:
133297.84
Organism:
Homo sapiens (Human)
Description:
P29474
Residue:
1203
  
Inhibitor
Name:
BDBM50058451
Synonyms:
2-Ethyl-1-(4-isopropyl-phenyl)-isothiourea; hydrochloride CHEMBL553038
Type:
Small organic molecule
Emp. Form.:
C12H18N2S
Mol. Mass.:
222.35
SMILES:
CCSC(N)=Nc1ccc(cc1)C(C)C
: