Target
Nitric oxide synthase, endothelial
Ligand
BDBM50058446
Substrate
Meas. Tech.
ChEMBL_65317 (CHEMBL678090)
Ki
7000±n/a nM
Citation
 Shearer, BGLee, SOplinger, JAFrick, LWGarvey, EPFurfine, ES Substituted N-phenylisothioureas: potent inhibitors of human nitric oxide synthase with neuronal isoform selectivity. J Med Chem 40:1901-5 (1997)  
Target
Name:
Nitric oxide synthase, endothelial
Synonyms:
Constitutive NOS Endothelial NOS NOS type III NOS3_HUMAN Nitric oxide synthase (inducible and endothelial) Nitric-oxide synthase (endothelial and brain) eNOS
Type:
Enzyme Catalytic Domain
Mol. Mass.:
133297.84
Organism:
Homo sapiens (Human)
Description:
P29474
Residue:
1203
  
Inhibitor
Name:
BDBM50058446
Synonyms:
2-Ethyl-1-pyridin-3-yl-isothiourea; hydrochloride CHEMBL542125
Type:
Small organic molecule
Emp. Form.:
C8H11N3S
Mol. Mass.:
181.258
SMILES:
CCSC(N)=Nc1cccnc1
: