Target
Melanocortin receptor 3
Ligand
BDBM50058962
Substrate
Meas. Tech.
ChEMBL_106014 (CHEMBL716370)
IC50
>10000±n/a nM
Citation
 Haskell-Luevano, CHendrata, SNorth, CSawyer, TKHadley, MEHruby, VJDickinson, CGantz, I Discovery of prototype peptidomimetic agonists at the human melanocortin receptors MC1R and MC4R. J Med Chem 40:2133-9 (1997)  
Target
Name:
Melanocortin receptor 3
Synonyms:
MC3-R MC3R_HUMAN Melanocortin receptor (M3 and M4)
Type:
Enzyme
Mol. Mass.:
36044.86
Organism:
Homo sapiens (Human)
Description:
P41968
Residue:
323
  
Inhibitor
Name:
BDBM50058962
Synonyms:
(S)-2-((S)-2-Acetylamino-3-phenyl-propionylamino)-5-guanidino-pentanoic acid [(R)-1-carbamoyl-2-(1H-indol-3-yl)-ethyl]-amide | CHEMBL66866
Type:
Small organic molecule
Emp. Form.:
C28H36N8O4
Mol. Mass.:
548.6366
SMILES:
CC(=O)N[C@@H](Cc1ccccc1)C(=O)N[C@@H](CCCNC(N)=N)C(=O)N[C@H](Cc1c[nH]c2ccccc12)C(N)=O
: