Target
Glucagon receptor
Ligand
BDBM50059359
Substrate
Meas. Tech.
ChEMBL_73016 (CHEMBL681695)
IC50
52±n/a nM
Citation
 Azizeh, BYAhn, JMCaspari, RShenderovich, MDTrivedi, DHruby, VJ The role of phenylalanine at position 6 in glucagon's mechanism of biological action: multiple replacement analogues of glucagon. J Med Chem 40:2555-62 (1997)  
Target
Name:
Glucagon receptor
Synonyms:
GL-R Gcgr
Type:
PROTEIN
Mol. Mass.:
55053.40
Organism:
Rattus norvegicus
Description:
ChEMBL_1450588
Residue:
485
  
Inhibitor
Name:
BDBM50059359
Synonyms:
CHEMBL411289 | [des-His1, des-Gly4, Glu9] glucagon-NH2
Type:
Small organic molecule
Emp. Form.:
C146H218N40O46S
Mol. Mass.:
3301.599
SMILES:
CSCC[C@@H](NC(=O)[C@@H](CC(C)C)NC(=O)[C@@H](Cc1c[nH]c2ccccc12)NC(=O)[C@@H](CCC(N)=O)NC(=O)[C@H](NC(=O)[C@@H](Cc1ccccc1)NC(=O)[C@@H](CC(O)=O)NC(=O)[C@@H](CCC(N)=O)NC(=O)[C@@H](C)NC(=O)[C@@H](CCCNC(N)=N)NC(=O)[C@@H](CCCNC(N)=N)NC(=O)[C@@H](CO)NC(=O)[C@@H](CC(O)=O)NC(=O)[C@@H](CC(C)C)NC(=O)[C@@H](Cc1ccc(O)cc1)NC(=O)[C@@H](CCCCN)NC(=O)[C@@H](CO)NC(=O)[C@@H](Cc1ccc(O)cc1)NC(=O)[C@@H](CCC(O)=O)NC(=O)[C@@H](CO)NC(=O)[C@H](NC(=O)[C@@H](Cc1ccccc1)NC(=O)[C@H](NC(=O)[C@@H](CCC(N)=O)NC(=O)[C@H](N)CO)[C@H](C)O)[C@H](C)O)C(C)C)C(=O)N[C@H](CC(N)=O)C(=O)N[C@H]([C@H](C)O)C(N)=O
: