Target
Adenosine receptor A2a
Ligand
BDBM50048454
Substrate
Meas. Tech.
ChEMBL_31366 (CHEMBL644658)
Ki
54300±n/a nM
Citation
 Jiang, QLee, BXGlashofer, Mvan Rhee, AMJacobson, KA Mutagenesis reveals structure-activity parallels between human A2A adenosine receptors and biogenic amine G protein-coupled receptors. J Med Chem 40:2588-95 (1997)  
Target
Name:
Adenosine receptor A2a
Synonyms:
A2A adenosine receptor (hA2A) ADENOSINE A2 ADORA2 Adenosine A2A receptor (A2AAR)
Type:
G Protein-Coupled Receptor (GPCR)
Mol. Mass.:
44716.46
Organism:
Homo sapiens (Human)
Description:
P29274
Residue:
412
  
Inhibitor
Name:
BDBM50048454
Synonyms:
3-Benzylsulfanyl-4-oxo-4,5,6,7-tetrahydro-benzo[c]thiophene-1-carboxylic acid ethyl ester | CHEMBL87496
Type:
Small organic molecule
Emp. Form.:
C18H18O3S2
Mol. Mass.:
346.464
SMILES:
CCOC(=O)c1sc(SCc2ccccc2)c2c1CCCC2=O
: