Target
Polyunsaturated fatty acid 5-lipoxygenase
Ligand
BDBM50029559
Substrate
Meas. Tech.
ChEMBL_3795 (CHEMBL619870)
IC50
5000±n/a nM
Citation
 Hamel, PRiendeau, DBrideau, CChan, CCDesmarais, SDelorme, DDubé, DDucharme, YEthier, DGrimm, EFalgueyret, JPGuay, JJones, TRKwong, EMcAuliffe, MMcFarlane, CSPiechuta, HRoumi, MTagari, PYoung, RNGirard, Y Substituted (pyridylmethoxy)naphthalenes as potent and orally active 5-lipoxygenase inhibitors; synthesis, biological profile, and pharmacokinetics of L-739,010. J Med Chem 40:2866-75 (1997)  
Target
Name:
Polyunsaturated fatty acid 5-lipoxygenase
Synonyms:
5-LO 5-Lipoxygenase (5-LO) 5-Lipoygenase ALOX5 LOG5 | LOX5_HUMAN
Type:
Enzyme
Mol. Mass.:
77972.74
Organism:
Homo sapiens (Human)
Description:
Recombinant protein was purified from E. coli lysate. After ammonium sulfate precipitation and subsequent steps, the supernatant (S100) was used for 5-LO activity assay.
Residue:
674
  
Inhibitor
Name:
BDBM50029559
Synonyms:
2-[3-tert-Butylsulfanyl-1-(4-chloro-benzyl)-5-(quinolin-2-ylmethoxy)-1H-indol-2-yl]-2-methyl-propionic acid 3-(3-(tert-butylthio)-1-(4-chlorobenzyl)-5-(quinolin-2-ylmethoxy)-1H-indol-2-yl)-2,2-dimethylpropanoic acid 3-[3-tert-Butylsulfanyl-1-(4-chloro-benzyl)-5-(quinolin-2-ylmethoxy)-1H-indol-2-yl]-2,2-dimethyl-propionic acid L-686708 | MK-591
Type:
Small organic molecule
Emp. Form.:
C34H35ClN2O3S
Mol. Mass.:
587.171
SMILES:
CC(C)(C)Sc1c(CC(C)(C)C(O)=O)n(Cc2ccc(Cl)cc2)c2ccc(OCc3ccc4ccccc4n3)cc12
: