Target
Translocator protein
Ligand
BDBM50060088
Substrate
Meas. Tech.
ChEMBL_39448 (CHEMBL653024)
IC50
4±n/a nM
Citation
 Trapani, GFranco, MRicciardi, LLatrofa, AGenchi, GSanna, ETuveri, FCagetti, EBiggio, GLiso, G Synthesis and binding affinity of 2-phenylimidazo[1,2-alpha]pyridine derivatives for both central and peripheral benzodiazepine receptors. A new series of high-affinity and selective ligands for the peripheral type. J Med Chem 40:3109-18 (1997)  
Target
Name:
Translocator protein
Synonyms:
Benzodiazepine receptors; peripheral & central Mbr PBR Peripheral benzodiazepine receptor (PBR) TSPO_RAT | Tspo
Type:
Mitochondrion membrane protein
Mol. Mass.:
18945.84
Organism:
Rattus norvegicus (rat)
Description:
Competitive binding experiments were performed on rat kidney mitochondrial membranes.
Residue:
169
  
Inhibitor
Name:
BDBM50060088
Synonyms:
2-(6-Chloro-2-phenyl-imidazo[1,2-a]pyridin-3-yl)-N,N-dipropyl-acetamide | CHEMBL104174
Type:
Small organic molecule
Emp. Form.:
C21H24ClN3O
Mol. Mass.:
369.888
SMILES:
CCCN(CCC)C(=O)Cc1c(nc2ccc(Cl)cn12)-c1ccccc1
: