Target
Protein farnesyltransferase subunit beta/geranylgeranyltransferase type-1 subunit alpha
Ligand
BDBM50055604
Substrate
Meas. Tech.
ChEMBL_70745 (CHEMBL681456)
IC50
6±n/a nM
Citation
 Leonard, DMShuler, KRPoulter, CJEaton, SRSawyer, TKHodges, JCSu, TZScholten, JDGowan, RCSebolt-Leopold, JSDoherty, AM Structure-activity relationships of cysteine-lacking pentapeptide derivatives that inhibit ras farnesyltransferase. J Med Chem 40:192-200 (1997)  
Target
Name:
Protein farnesyltransferase subunit beta/geranylgeranyltransferase type-1 subunit alpha
Synonyms:
Protein Farnesyltransferase (PFT)/farnesyltransferase beta subunit | Protein farnesyltransferase
Type:
Mol. Mass.:
Description:
ASSAY_ID of EBI is 69815
Components:
This complex has 2 components.
Component 1
Name:
Protein farnesyltransferase subunit beta
Synonyms:
CAAX farnesyltransferase subunit beta FTase-beta Protein farnesyltransferase Ras proteins prenyltransferase subunit beta
Type:
PROTEIN
Mol. Mass.:
48666.41
Organism:
Rattus norvegicus
Description:
EBI_10573
Residue:
437
  
Component 2
Name:
Protein farnesyltransferase/geranylgeranyltransferase type-1 subunit alpha
Synonyms:
CAAX farnesyltransferase alpha subunit FTase-alpha GGTase-I-alpha Protein farnesyltransferase/geranylgeranyltransferase type I alpha subunit Type I protein geranyl-geranyltransferase alpha subunit | geranylgeranyltransferase type-I
Type:
Enzyme
Mol. Mass.:
44030.14
Organism:
Rattus norvegicus (rat)
Description:
Recombinant rat enzyme.
Residue:
377
  
Inhibitor
Name:
BDBM50055604
Synonyms:
CHEMBL441189 | [(R)-1-[(R)-1-{(R)-2-Benzyloxy-1-[(R)-1-((S)-1-carbamoyl-ethylcarbamoyl)-2-(1H-indol-3-yl)-ethylcarbamoyl]-ethylcarbamoyl}-2-(4-phosphonooxy-phenyl)-ethylcarbamoyl]-2-(1H-imidazol-4-yl)-ethyl]-carbamic acid benzyl ester
Type:
Small organic molecule
Emp. Form.:
C47H52N9O12P
Mol. Mass.:
965.9426
SMILES:
C[C@H](NC(=O)[C@@H](Cc1c[nH]c2ccccc12)NC(=O)[C@@H](COCc1ccccc1)NC(=O)[C@@H](Cc1ccc(OP(O)(O)=O)cc1)NC(=O)[C@@H](Cc1cnc[nH]1)NC(=O)OCc1ccccc1)C(N)=O
: