Target
DNA topoisomerase 1
Ligand
BDBM50055651
Substrate
Meas. Tech.
ChEMBL_208415 (CHEMBL821422)
IC50
4818±n/a nM
Citation
 Zhao, Ral-Said, NHSternbach, DLLown, JW Camptothecin and minor-groove binder hybrid molecules: synthesis, inhibition of topoisomerase I, and anticancer cytotoxicity in vitro. J Med Chem 40:216-25 (1997)  
Target
Name:
DNA topoisomerase 1
Synonyms:
DNA topoisomerase I TOP1 | TOP1_HUMAN
Type:
Enzyme
Mol. Mass.:
90771.02
Organism:
Homo sapiens (Human)
Description:
P11387
Residue:
765
  
Inhibitor
Name:
BDBM50055651
Synonyms:
10-[2-[1-(Methoxymethyl)-4-[1-(methoxymethyl)-4-[4-(dimethylamino)butyramidopyrrole-2-carboxamido]pyrrole-2-carboxamido]ethoxy]-20(R,S)-camptothecin | CHEMBL64874
Type:
Small organic molecule
Emp. Form.:
C42H48N8O10
Mol. Mass.:
824.8781
SMILES:
CCC1(O)C(=O)OCc2c1cc1-c3nc4ccc(OCCNC(=O)c5cc(NC(=O)c6cc(NC(=O)CCCN(C)C)cn6COC)cn5COC)cc4cc3Cn1c2=O
: