Target
5-hydroxytryptamine receptor 3A/3B
Ligand
BDBM50060243
Substrate
Meas. Tech.
ChEMBL_2997 (CHEMBL872925)
Ki
12±n/a nM
Citation
 Heidempergher, FPillan, APinciroli, VVaghi, FArrigoni, CBolis, GCaccia, CDho, LMcArthur, RVarasi, M Phenylimidazolidin-2-one derivatives as selective 5-HT3 receptor antagonists and refinement of the pharmacophore model for 5-HT3 receptor binding. J Med Chem 40:3369-80 (1997)  
Target
Name:
5-hydroxytryptamine receptor 3A/3B
Synonyms:
Serotonin 3 (5-HT3) receptor | Serotonin 3a (5-HT3a)/3b (5-HT3b) receptor
Type:
Mol. Mass.:
Description:
ASSAY_ID of EBI is 2974
Components:
This complex has 2 components.
Component 1
Name:
5-hydroxytryptamine receptor 3B
Synonyms:
5HT3B_RAT Serotonin (5-HT) receptor
Type:
PROTEIN
Mol. Mass.:
50328.78
Organism:
Rattus norvegicus
Description:
EBI_11885
Residue:
437
  
Component 2
Name:
5-hydroxytryptamine receptor 3A
Synonyms:
5-HT3 5HT3A_RAT Htr3 Serotonin (5-HT) receptor | Zacopride site-R
Type:
Enzyme Catalytic Domain
Mol. Mass.:
55428.70
Organism:
RAT
Description:
5-HT3 HTR3A RAT::P35563
Residue:
483
  
Inhibitor
Name:
BDBM50060243
Synonyms:
1-(8-Methyl-8-aza-bicyclo[3.2.1]oct-3-yl)-3-phenyl-imidazolidin-2-one | CHEMBL333398
Type:
Small organic molecule
Emp. Form.:
C17H23N3O
Mol. Mass.:
285.384
SMILES:
CN1C2CCC1CC(C2)N1CCN(C1=O)c1ccccc1
: