Target
Glutamate receptor 4
Ligand
BDBM50060628
Substrate
Meas. Tech.
ChEMBL_90301 (CHEMBL878454)
Ki
3.6±n/a nM
Citation
 Jane, DEHoo, KKamboj, RDeverill, MBleakman, DMandelzys, A Synthesis of willardiine and 6-azawillardiine analogs: pharmacological characterization on cloned homomeric human AMPA and kainate receptor subtypes. J Med Chem 40:3645-50 (1997)  
Target
Name:
Glutamate receptor 4
Synonyms:
GLUR4 GRIA4_HUMAN Glutamate receptor ionotropic AMPA | Glutamate receptor ionotropic, AMPA 4
Type:
PROTEIN
Mol. Mass.:
100881.87
Organism:
Homo sapiens (Human)
Description:
ChEMBL_468628
Residue:
902
  
Inhibitor
Name:
BDBM50060628
Synonyms:
(S)-2-Amino-3-(6-chloro-3,5-dioxo-4,5-dihydro-3H-[1,2,4]triazin-2-yl)-propionic acid | CHEMBL331696
Type:
Small organic molecule
Emp. Form.:
C6H7ClN4O4
Mol. Mass.:
234.597
SMILES:
N[C@@H](Cn1nc(Cl)c(=O)[nH]c1=O)C(O)=O
: