Target
Metabotropic glutamate receptor 2
Ligand
BDBM50060718
Substrate
Meas. Tech.
ChEMBL_106196 (CHEMBL884501)
EC50
>1000000±n/a nM
Citation
 Ahmadian, HNielsen, BBräuner-Osborne, HJohansen, TNStensbøl, TBSløk, FASekiyama, NNakanishi, SKrogsgaard-Larsen, PMadsen, U (S)-homo-AMPA, a specific agonist at the mGlu6 subtype of metabotropic glutamic acid receptors. J Med Chem 40:3700-5 (1997)  
Target
Name:
Metabotropic glutamate receptor 2
Synonyms:
GPRC1B GRM2_HUMAN Metabotropic glutamate receptor mGlu2 | metabotropic glutamate 2
Type:
Enzyme
Mol. Mass.:
95584.88
Organism:
Homo sapiens (Human)
Description:
Q14416
Residue:
872
  
Inhibitor
Name:
BDBM50060718
Synonyms:
(R)-2-Amino-4-(3-hydroxy-5-methyl-isoxazol-4-yl)-butyric acid CHEMBL262416
Type:
Small organic molecule
Emp. Form.:
C8H12N2O4
Mol. Mass.:
200.1919
SMILES:
Cc1o[nH]c(=O)c1CC[C@@H](N)C(O)=O
: