Target
Metabotropic glutamate receptor 5
Ligand
BDBM50060718
Substrate
Meas. Tech.
ChEMBL_104283 (CHEMBL711718)
EC50
>1000000±n/a nM
Citation
 Ahmadian, HNielsen, BBräuner-Osborne, HJohansen, TNStensbøl, TBSløk, FASekiyama, NNakanishi, SKrogsgaard-Larsen, PMadsen, U (S)-homo-AMPA, a specific agonist at the mGlu6 subtype of metabotropic glutamic acid receptors. J Med Chem 40:3700-5 (1997)  
Target
Name:
Metabotropic glutamate receptor 5
Synonyms:
GRM5_RAT Grm5 Mglur5 metabotropic glutamate 5/1-C metabotropic glutamate 5a
Type:
Enzyme
Mol. Mass.:
131900.14
Organism:
Rattus norvegicus (Rat)
Description:
P31424
Residue:
1203
  
Inhibitor
Name:
BDBM50060718
Synonyms:
(R)-2-Amino-4-(3-hydroxy-5-methyl-isoxazol-4-yl)-butyric acid CHEMBL262416
Type:
Small organic molecule
Emp. Form.:
C8H12N2O4
Mol. Mass.:
200.1919
SMILES:
Cc1o[nH]c(=O)c1CC[C@@H](N)C(O)=O
: