Target
Adenosine receptor A2a
Ligand
BDBM50454668
Substrate
Meas. Tech.
ChEMBL_32149 (CHEMBL646276)
Ki
6850±n/a nM
Citation
 Van Calenbergh, Svon Frijtag Drabbe Künzel, JKBlaton, NMPeeters, OMRozenski, JVan Aerschot, ADe Bruyn, ADe Keukeleire, DIJzerman, APHerdewijn, P N6-cyclopentyl-3'-substituted-xylofuranosyladenosines: a new class of non-xanthine adenosine A1 receptor antagonists. J Med Chem 40:3765-72 (1997)  
Target
Name:
Adenosine receptor A2a
Synonyms:
AA2AR_RAT Adenosine A2 receptor Adenosine Receptors A2a (A2a) Adenosine receptors A2a Rat striatal adenosine A2a receptor
Type:
G Protein-Coupled Receptor (GPCR)
Mol. Mass.:
45015.65
Organism:
Rattus norvegicus (rat)
Description:
Rat A2A receptors expressed in CHO cells.
Residue:
410
  
Inhibitor
Name:
BDBM50454668
Synonyms:
CHEMBL2112631
Type:
Small organic molecule
Emp. Form.:
C22H25N7O6
Mol. Mass.:
483.4772
SMILES:
OC[C@H]1O[C@H]([C@H](O)[C@H]1NC(=O)c1ccc(cc1)[N+]([O-])=O)n1cnc2c(NC3CCCC3)ncnc12
: