Target
Adenosine receptor A1
Ligand
BDBM50454669
Substrate
Meas. Tech.
ChEMBL_28848 (CHEMBL646710)
Ki
200±n/a nM
Citation
 Van Calenbergh, Svon Frijtag Drabbe Künzel, JKBlaton, NMPeeters, OMRozenski, JVan Aerschot, ADe Bruyn, ADe Keukeleire, DIJzerman, APHerdewijn, P N6-cyclopentyl-3'-substituted-xylofuranosyladenosines: a new class of non-xanthine adenosine A1 receptor antagonists. J Med Chem 40:3765-72 (1997)  
Target
Name:
Adenosine receptor A1
Synonyms:
AA1R_RAT ADENOSINE A1 high Adenosine A1 receptor (A1) Adenosine receptors A1 | Adora1
Type:
Protein
Mol. Mass.:
36704.13
Organism:
Rattus norvegicus (rat)
Description:
Residue:
326
  
Inhibitor
Name:
BDBM50454669
Synonyms:
CHEMBL2112632
Type:
Small organic molecule
Emp. Form.:
C26H34N6O4
Mol. Mass.:
494.586
SMILES:
OC[C@H]1O[C@H]([C@H](O)[C@H]1NC(=O)CCCCc1ccccc1)n1cnc2c(NC3CCCC3)ncnc12
: