Target
Sodium-dependent dopamine transporter
Ligand
BDBM50451132
Substrate
Meas. Tech.
ChEMBL_62007 (CHEMBL671629)
IC50
14±n/a nM
Citation
 Blough, BEAbraham, PMills, ACLewin, AHBoja, JWScheffel, UKuhar, MJCarroll, FI 3 Beta-(4-ethyl-3-iodophenyl)nortropane-2 beta-carboxylic acid methyl ester as a high-affinity selective ligand for the serotonin transporter. J Med Chem 40:3861-4 (1998)  
Target
Name:
Sodium-dependent dopamine transporter
Synonyms:
DA transporter SC6A3_RAT Sodium-dependent dopamine transporter | Sodium-dependent dopamine transporter (DAT)
Type:
Multi-pass membrane protein
Mol. Mass.:
68749.45
Organism:
Rattus norvegicus (rat)
Description:
P23977
Residue:
619
  
Inhibitor
Name:
BDBM50451132
Synonyms:
CHEMBL2079586 | WIN-35428
Type:
Small organic molecule
Emp. Form.:
C16H20FNO2
Mol. Mass.:
277.3339
SMILES:
[H][C@@]12CC[C@]([H])([C@H]([C@H](C1)c1ccc(F)cc1)C(=O)OC)N2C
: