Target
Sodium-dependent serotonin transporter
Ligand
BDBM50061203
Substrate
Meas. Tech.
ChEMBL_201651 (CHEMBL806552)
IC50
0.69±n/a nM
Citation
 Blough, BEAbraham, PMills, ACLewin, AHBoja, JWScheffel, UKuhar, MJCarroll, FI 3 Beta-(4-ethyl-3-iodophenyl)nortropane-2 beta-carboxylic acid methyl ester as a high-affinity selective ligand for the serotonin transporter. J Med Chem 40:3861-4 (1998)  
Target
Name:
Sodium-dependent serotonin transporter
Synonyms:
5-HT Transporter 5HT transporter Anandamid membrane transporter, AMT Monoamine transporters; Norepinephrine & serotonin Slc6a4 Sodium-dependent serotonin transporter (SERT) | imipramine receptor
Type:
Multi-pass membrane protein
Mol. Mass.:
70168.43
Organism:
Rattus norvegicus (rat)
Description:
P31652
Residue:
630
  
Inhibitor
Name:
BDBM50061203
Synonyms:
(R)-3-(4-Ethyl-3-iodo-phenyl)-8-aza-bicyclo[3.2.1]octane-2-carboxylic acid methyl ester | CHEMBL127623
Type:
Small organic molecule
Emp. Form.:
C17H22INO2
Mol. Mass.:
399.2666
SMILES:
CCc1ccc(cc1I)C1CC2CCC(N2)C1C(=O)OC
: