Target
Acetylcholine receptor subunit alpha/beta/delta/gamma
Ligand
BDBM50035398
Substrate
Meas. Tech.
ChEMBL_216979 (CHEMBL822796)
Ki
>10000±n/a nM
Citation
 Holladay, MWDart, MJLynch, JK Neuronal nicotinic acetylcholine receptors as targets for drug discovery. J Med Chem 40:4169-94 (1998)  
Target
Name:
Acetylcholine receptor subunit alpha/beta/delta/gamma
Synonyms:
Acetylcholine receptor | Acetylcholine receptor protein alpha/beta/delta/gamma chain
Type:
Mol. Mass.:
Description:
ASSAY_ID of EBI is 143080
Components:
This complex has 4 components.
Component 1
Name:
Acetylcholine receptor subunit beta
Synonyms:
ACHB_TETCF CHRNB1
Type:
PROTEIN
Mol. Mass.:
56146.98
Organism:
Torpedo californica
Description:
EBI_19626
Residue:
493
  
Component 2
Name:
Acetylcholine receptor subunit gamma
Synonyms:
ACHG_TETCF CHRNG
Type:
PROTEIN
Mol. Mass.:
58151.68
Organism:
Torpedo californica
Description:
EBI_19662
Residue:
506
  
Component 3
Name:
Acetylcholine receptor subunit alpha
Synonyms:
ACHA_TETCF Acetylcholine receptor protein alpha chain | CHRNA1
Type:
PROTEIN
Mol. Mass.:
52735.09
Organism:
Torpedo californica
Description:
ChEMBL_216981
Residue:
461
  
Component 4
Name:
Acetylcholine receptor subunit delta
Synonyms:
ACHD_TETCF Acetylcholine receptor protein delta chain | chrnd
Type:
PROTEIN
Mol. Mass.:
59885.01
Organism:
Torpedo californica
Description:
ChEMBL_142744
Residue:
522
  
Inhibitor
Name:
BDBM50035398
Synonyms:
(S)-1-Methyl-2-(3-methyl-isoxazol-5-yl)-pyrrolidinium 3-Methyl-5-((S)-1-methyl-pyrrolidin-2-yl)-isoxazole CHEMBL274525
Type:
Small organic molecule
Emp. Form.:
C9H14N2O
Mol. Mass.:
166.2203
SMILES:
CN1CCC[C@H]1c1cc(C)no1
: