Target
D(2) dopamine receptor
Ligand
BDBM50061678
Substrate
Meas. Tech.
ChEMBL_62884 (CHEMBL673594)
Ki
1.1±n/a nM
Citation
 Mewshaw, REKavanagh, JStack, GMarquis, KLShi, XKagan, MZWebb, MBKatz, AHPark, AKang, YHAbou-Gharbia, MScerni, RWasik, TCortes-Burgos, LSpangler, TBrennan, JAPiesla, MMazandarani, HCockett, MIOchalski, RCoupet, JAndree, TH New generation dopaminergic agents. 1. Discovery of a novel scaffold which embraces the D2 agonist pharmacophore. Structure-activity relationships of a series of 2-(aminomethyl)chromans. J Med Chem 40:4235-56 (1998)  
Target
Name:
D(2) dopamine receptor
Synonyms:
DOPAMINE D2 DOPAMINE D2 Short Dopamine D2 receptor Drd2
Type:
G Protein-Coupled Receptor (GPCR)
Mol. Mass.:
50931.60
Organism:
Rattus norvegicus (rat)
Description:
P61169
Residue:
444
  
Inhibitor
Name:
BDBM50061678
Synonyms:
2-{[(Furan-2-ylmethyl)-amino]-methyl}-chroman-7-ol; oxalic acid | CHEMBL134582
Type:
Small organic molecule
Emp. Form.:
C15H17NO3
Mol. Mass.:
259.3004
SMILES:
Oc1ccc2CCC(CNCc3ccco3)Oc2c1
: