Target
Sigma non-opioid intracellular receptor 1
Ligand
BDBM50061794
Substrate
Meas. Tech.
ChEMBL_201737 (CHEMBL803933)
IC50
37±n/a nM
Citation
 Hu, LYGuo, JMagar, SSFischer, JBBurke-Howie, KJDurant, GJ Synthesis and pharmacological evaluation of N-(2,5-disubstituted phenyl)-N'-(3-substituted phenyl)-N'-methylguanidines as N-methyl-D-aspartate receptor ion-channel blockers. J Med Chem 40:4281-9 (1998)  
Target
Name:
Sigma non-opioid intracellular receptor 1
Synonyms:
Aging-associated gene 8 protein SGMR1_HUMAN SIGMAR1 SR31747-binding protein Sigma 1-type opioid receptor Sigma1R | hSigmaR1
Type:
Enzyme Catalytic Domain
Mol. Mass.:
25124.85
Organism:
Homo sapiens (Human)
Description:
Q99720
Residue:
223
  
Inhibitor
Name:
BDBM50061794
Synonyms:
CHEMBL539299 | N-(2,4-Dichloro-phenyl)-N'-(3-ethyl-phenyl)-guanidine; hydrochloride
Type:
Small organic molecule
Emp. Form.:
C15H15Cl2N3
Mol. Mass.:
308.206
SMILES:
CCc1cccc(NC(N)=Nc2ccc(Cl)cc2Cl)c1
: