Target
Muscarinic acetylcholine receptor M1
Ligand
BDBM50046723
Substrate
Meas. Tech.
ChEMBL_138670 (CHEMBL748967)
Ki
21±n/a nM
Citation
 Messer, WSAbuh, YFLiu, YPeriyasamy, SNgur, DOEdgar, MAEl-Assadi, AASbeih, SDunbar, PGRoknich, SRho, TFang, ZOjo, BZhang, HHuzl, JJNagy, PI Synthesis and biological characterization of 1,4,5,6-tetrahydropyrimidine and 2-amino-3,4,5,6-tetrahydropyridine derivatives as selective m1 agonists. J Med Chem 40:1230-46 (1997)  
Target
Name:
Muscarinic acetylcholine receptor M1
Synonyms:
ACM1_MOUSE Cholinergic, muscarinic Chrm1 Muscarinic acetylcholine receptor M1
Type:
Enzyme Catalytic Domain
Mol. Mass.:
51400.50
Organism:
Mus musculus
Description:
Cholinergic, muscarinic 0 0::Q52KQ0
Residue:
460
  
Inhibitor
Name:
BDBM50046723
Synonyms:
5-(3-Methyl-[1,2,4]oxadiazol-5-yl)-1,4,5,6-tetrahydro-pyrimidine; TFA | CHEMBL277014
Type:
Small organic molecule
Emp. Form.:
C7H10N4O
Mol. Mass.:
166.1805
SMILES:
Cc1noc(n1)C1CNC=NC1
: