Target
Muscarinic acetylcholine receptor M3
Ligand
BDBM50004656
Substrate
Meas. Tech.
ChEMBL_138834 (CHEMBL753022)
EC50
9900±n/a nM
Citation
 Messer, WSAbuh, YFLiu, YPeriyasamy, SNgur, DOEdgar, MAEl-Assadi, AASbeih, SDunbar, PGRoknich, SRho, TFang, ZOjo, BZhang, HHuzl, JJNagy, PI Synthesis and biological characterization of 1,4,5,6-tetrahydropyrimidine and 2-amino-3,4,5,6-tetrahydropyridine derivatives as selective m1 agonists. J Med Chem 40:1230-46 (1997)  
Target
Name:
Muscarinic acetylcholine receptor M3
Synonyms:
ACM3_MOUSE Chrm3 Muscarinic acetylcholine receptor | Muscarinic acetylcholine receptor M3
Type:
PROTEIN
Mol. Mass.:
66232.94
Organism:
Mus musculus
Description:
ChEMBL_138834
Residue:
589
  
Inhibitor
Name:
BDBM50004656
Synonyms:
(2-Carbamoyloxy-ethyl)-trimethyl-ammonium (2-Hydroxyethyl)trimethyl ammonium chloride carbamate (carbachol)(2-Carbamoyloxy-ethyl)-trimethyl-ammonium 2-((Aminocarbonyl)oxy)-N,N,N-trimethylethanaminum chloride 2-(carbamoyloxy)-N,N,N-trimethylethanaminium chloride CARBASTAT Carbachol chloride Choline carbamate chloride Choline chlorine carbamate Karbamoylcholin chlorid | MIOSTAT
Type:
Small organic molecule
Emp. Form.:
C6H15N2O2
Mol. Mass.:
147.195
SMILES:
C[N+](C)(C)CCOC(N)=O
: