Target
Sodium-dependent dopamine transporter
Ligand
BDBM50454883
Substrate
Meas. Tech.
ChEMBL_62147 (CHEMBL675903)
IC50
28±n/a nM
Citation
 Chang, ACBurgess, JPMascarella, SWAbraham, PKuhar, MJCarroll, FI Synthesis and transporter binding properties of 2,3-diphenyltropane stereoisomers. Comparison to 3beta-phenyltropane-2beta-carboxylic acid esters. J Med Chem 40:1247-51 (1997)  
Target
Name:
Sodium-dependent dopamine transporter
Synonyms:
DA transporter SC6A3_RAT Sodium-dependent dopamine transporter | Sodium-dependent dopamine transporter (DAT)
Type:
Multi-pass membrane protein
Mol. Mass.:
68749.45
Organism:
Rattus norvegicus (rat)
Description:
P23977
Residue:
619
  
Inhibitor
Name:
BDBM50454883
Synonyms:
CHEMBL3085557
Type:
Small organic molecule
Emp. Form.:
C20H23N
Mol. Mass.:
277.4033
SMILES:
[H][C@@]12CC[C@@]([H])([C@H]([C@H](C1)c1ccccc1)c1ccccc1)N2C
: