Target
3-oxo-5-alpha-steroid 4-dehydrogenase 2
Ligand
BDBM50057467
Substrate
Meas. Tech.
ChEMBL_202900 (CHEMBL807652)
Ki
10±n/a nM
Citation
 Kenny, BBallard, SBlagg, JFox, D Pharmacological options in the treatment of benign prostatic hyperplasia. J Med Chem 40:1293-315 (1997)  
Target
Name:
3-oxo-5-alpha-steroid 4-dehydrogenase 2
Synonyms:
3-oxo-5-alpha-steroid 4-dehydrogenase 2 5α-Reductase 2 (5α-R2) SR type 2 Steroid 5-alpha-reductase Type II 5-alpha reductase
Type:
Enzyme
Mol. Mass.:
28406.59
Organism:
Homo sapiens (Human)
Description:
P31213
Residue:
254
  
Inhibitor
Name:
BDBM50057467
Synonyms:
4-[4-(4-Methyl-benzoyl)-benzoyl]-benzoic acid | CHEMBL25093
Type:
Small organic molecule
Emp. Form.:
C22H16O4
Mol. Mass.:
344.36
SMILES:
Cc1ccc(cc1)C(=O)c1ccc(cc1)C(=O)c1ccc(cc1)C(O)=O
: